{"text_format":"1","workbook":"xlsx","n_sheets":11,"sheets":["X5 CALCULATOR","DEURBLAD","TECHNISCHE INFORMATIE","MAATWERK","STAANDERS","MIDDENSTAANDERS","RAIL","AFWERKING","GREPEN","OPMERKINGEN","INVULVELDEN"],"not_rendered":{"charts":0,"images":19,"macros":1,"external_links":0,"defined_names":0,"comments":1,"pivot_tables":0},"unopened":[],"bounds":{"document_bytes":16777216,"sheet_cells":100000,"rows_first":2000,"rows_last":500,"rows_between":2000,"halvings":0,"cell_chars":16384,"cell_head_chars":4096},"cells_cut":0,"cells_raw":0,"read":"whole","date_system":"1900"}

{"sheet":"X5 CALCULATOR","index":0,"n_rows":47,"n_cols":9,"rows_kept":47,"cut":false,"hidden":false,"merged":[[42,7,42,8],[43,7,43,8],[23,6,23,8],[24,6,25,8],[19,6,19,8],[20,6,20,8]]}
[null,null,null,null,"X5 Bestelformulier "]
[]
[]
[null,null,null,null,"Rail + beslag"]
[null,null,null,null,"…"]
[null,null,null,null,"Beplating? ",null,"Aantal sets X5"]
[null,null,null,null,"…",null,1]
[null,null,null,null,"Hout of glas?"]
[null,{"$f":"IF(AND(E5=\"Hawa\",E9=\"Glas\"),OPMERKINGEN!B33,\"\")","v":""},null,null,"…"]
[null,null,null,null,"Enkele of dubbele deur? "]
[null,{"$f":"IF(AND(E17>2315,E23=75,E9=\"Hout\",OR(E7=\"Enkele (<2315) X5\",E7=\"Dubbel X5D\")),OPMERKINGEN!B7,\"\")","v":""},null,null,"…"]
[null,{"$f":"IF(AND(E7=\"Enkele (<2315) X5\",E17>2315,E13=\"Pocket\"),OPMERKINGEN!B2,IF(AND(E7=\"Dubbel X5D\",E17>3015,E13=\"Pocket\"),OPMERKINGEN!B3,IF(AND(E7=\"Enkele (<2315) X5\",E17>2415,E13=\"Wall\"),OPMERKINGEN!B4,\"\")))","v":""},null,null,"Pocket of WALL? "]
[null,{"$f":"IF(E19>1230,OPMERKINGEN!B6,\"\")","v":""},null,null,"…"]
[null,null,null,null,"Afwerking? "]
[null,{"$f":"IF(AND(E9=\"Glas\",E23=\"50\",E19>1030),OPMERKINGEN!B9,IF(AND(E9=\"Hout\",E23=\"50\"),OPMERKINGEN!B9,\"\"))","v":""},null,null,"…"]
[null,null,null,null,"Hoogte deurblad? (mm)"]
[null,{"$f":"IF(AND(E19>1030,E7=\"Enkele (<2315) X5\"),OPMERKINGEN!B29,\"\")","v":""},null,null,null,{"$f":"IF(E17=\"\",\"\",IF(E17<1000,\">1000 mm\",\"\"))","v":""}]
[null,{"$f":"IF(AND(E7=\"Enkele (<2315) X5\",E23=\"75\",E17>2315),OPMERKINGEN!B12,IF(AND(E7=\"Enkele (<2315) X5\",E23=\"75\",E17>2315,E15=\"XINNIX\"),OPMERKINGEN!B13,IF(AND(E7=\"Dubbel X5D\",E23=\"75\",E17>3015,E15=\"XINNIX\",AND(E7=\"Dubbel X5\",E23=\"100\",E17>3015,E15=\"XINNIX\",AND(OR(E7=\"Dubbel X5D32\",E7=\"Dubbel X5D50\"),E23=\"75\",E17>3015,E15=\"XINNIX\"))),OPMERKINGEN!B14,IF(AND(E7=\"Enkele (<2315) X5\",E23=\"100\",E17>3015,E15=\"PURE\",AND(E7=\"Dubbel X5D\",E23=\"75\",E17>3015,E15=\"PURE\",AND(E7=\"Dubbel X5D\",E23=\"100\",E17>3015,E15=\"PURE\"))),OPMERKINGEN!B15,IF(AND(E7=\"Enkele (<2315) X5\",E23=\"75\",E17>2315,E9=\"Glas\",AND(E7=\"Dubbel X5D\",E23=\"50\",E17>2315,E9=\"Glas\")),OPMERKINGEN!B16,IF(AND(OR(E7=\"Dubbel X5D32\",E7=\"Dubbel X5D50\"),E23=\"50\",E17>2715,E9=\"Glas\"),OPMERKINGEN!B17,\"\"))))))","v":""},null,null,"Breedte deurblad? (mm)"]
[null,{"$f":"IF(AND(E5=\"Xinnix Double Soft Slide\",E23=50),OPMERKINGEN!B34,\"\")","v":""},null,null,null,{"$f":"IF(E19=\"\",\"\",IF(AND(E5=\"Xinnix\",E19<530),\"≥ 530 mm\",IF(AND(E5=\"Hawa\",E19<800),\"≥ 800 mm\",IF(AND(E5=\"Xinnix Double Soft Slide\",E19<680),\"≥ 680 mm\",\"\"))))","v":""}]
[null,{"$f":"IF(AND(E23=50,E9=\"Hout\"),OPMERKINGEN!B18,\"\")","v":""},null,null,"Dikte deurblad? ",null,"Referentie"]
{"$rows_left_out":28}
{"sheet":"DEURBLAD","index":1,"n_rows":18,"n_cols":15,"rows_kept":18,"cut":false,"hidden":false,"merged":[[3,1,3,4],[3,6,3,9],[3,11,3,14],[11,1,11,4],[11,6,11,9],[11,11,11,14]]}
[]
[]
[]
[null,"HOUT -  AFWERKING XINNIX",null,null,null,null,"HOUT -  AFWERKING XINNIX",null,null,null,null,"HOUT -  AFWERKING XINNIX"]
[null,"DEURBLAD",null,"HOOGTE","BREEDTE",null,"DEURBLAD",null,"HOOGTE","BREEDTE",null,"DEURBLAD",null,"HOOGTE","BREEDTE"]
[null,null,null,2115,930,null,null,null,{"$f":"I8-90","v":2010},{"$f":"(J8-10)/2","v":445},null,null,null,{"$f":"N10+5","v":2115},{"$f":"O10+30","v":930}]
[null,"CONSTRUCTIE OPENING",null,"HOOGTE","BREEDTE",null,"CONSTRUCTIE OPENING",null,"HOOGTE","BREEDTE",null,"CONSTRUCTIE OPENING",null,"HOOGTE","BREEDTE"]
[null,null,null,{"$f":"D6+90","v":2205},{"$f":"(E6*2)+10","v":1870},null,null,null,2100,900,null,null,null,{"$f":"N10+95","v":2205},{"$f":"((O10+30)*2)+10","v":1870}]
[null,"VRIJE DOORGANG",null,"HOOGTE","BREEDTE",null,"VRIJE DOORGANG",null,"HOOGTE","BREEDTE",null,"VRIJE DOORGANG",null,"HOOGTE","BREEDTE"]
[null,null,null,{"$f":"D6+8-(95-82)","v":2110},{"$f":"E6-30","v":900},null,null,null,{"$f":"I8-95","v":2005},{"$f":"(J8-10)/2-30","v":415},null,null,null,2110,900]
[]
[null,"HOUT -  AFWERKING PURE",null,null,null,null,"HOUT -  AFWERKING PURE",null,null,null,null,"HOUT -  AFWERKING PURE"]
[null,"DEURBLAD",null,"HOOGTE","BREEDTE",null,"DEURBLAD",null,"HOOGTE","BREEDTE",null,"DEURBLAD",null,"HOOGTE","BREEDTE"]
[null,null,null,3286,960,null,null,null,{"$f":"I16-8-4-58","v":2565},{"$f":"(J16-10)/2","v":930},null,null,null,{"$f":"N18-8-4","v":2588},{"$f":"O18+30","v":1680}]
[null,"CONSTRUCTIE OPENING",null,"HOOGTE","BREEDTE",null,"CONSTRUCTIE OPENING",null,"HOOGTE","BREEDTE",null,"CONSTRUCTIE OPENING",null,"HOOGTE","BREEDTE"]
[null,null,null,{"$f":"D14+70","v":3356},{"$f":"(E14*2)+10","v":1930},null,null,null,2635,1870,null,null,null,{"$f":"N18+58","v":2658},{"$f":"((O18+30)*2)+10","v":3370}]
[null,"VRIJE DOORGANG",null,"HOOGTE","BREEDTE",null,"VRIJE DOORGANG",null,"HOOGTE","BREEDTE",null,"VRIJE DOORGANG",null,"HOOGTE","BREEDTE"]
[null,null,null,{"$f":"D14+8+4","v":3298},{"$f":"E14-30","v":930},null,null,null,{"$f":"I16-58","v":2577},{"$f":"(J16-10)/2-30","v":900},null,null,null,2600,1650]

{"sheet":"TECHNISCHE INFORMATIE","index":2,"n_rows":48,"n_cols":22,"rows_kept":48,"cut":false,"hidden":false,"merged":[[27,9,27,12],[44,9,44,12],[41,9,41,10],[41,11,41,12],[42,9,42,10],[42,11,42,12],[43,9,43,10],[43,11,43,12]]}
[]
[null,"Beplating",null,null,null,null,null,null,null,"Standaard of wall",null,null,null,null,null,null,null,"Afwerking",null,null,null,"Types"]
[]
[null,"X5",null,null,null,null,null,null,null,"Pocket",null,null,null,null,null,null,null,"Xinnix",null,null,null,"X5"]
[]
[]
[]
[]
[]
[]
[null,"X5D",null,null,null,null,null,null,null,null,null,null,null,null,null,null,null,null,null,null,null,"X5 XXL"]
[]
[]
[]
[null,null,null,null,null,null,null,null,null,"WALL",null,null,null,null,null,null,null,"Pure"]
[]
[null,null,null,null,null,null,null,null,null,null,null,null,null,null,null,null,null,null,null,null,null,"X5 dubbel"]
[null,"X5D32"]
[]
[]
{"$rows_left_out":29}
{"sheet":"MAATWERK","index":3,"n_rows":176,"n_cols":4,"rows_kept":176,"cut":false,"hidden":true,"merged":[]}
[null,"X5D-20.15B100","XINNIX X5D Schuifdeursysteem B 1500  H 2000 Pr 100 Md 150",758.54]
[null,"X5D-20.16B100","XINNIX XD5 Schuifdeursysteem B 1600  H 2000 Pr 100 Md 150",758.54]
[null,"X5D-20.17B100","XINNIX X5D Schuifdeursysteem B 1700  H 2000 Pr 100 Md 150",758.54]
[null,"X5D-20.18B100","XINNIX X5D Schuifdeursysteem B 1800  H 2000 Pr 100 Md 150",758.54]
[null,"X5D-20.19B100","XINNIX X5D Schuifdeursysteem B 1900  H 2000 Pr 100 Md 150",933.59]
[null,"X5D-20.20B100","XINNIX X5D Schuifdeursysteem B 2000  H 2000 Pr 100 Md 150",933.59]
[null,"X5D-20.21B100","XINNIX X5D Schuifdeursysteem B 2100  H 2000 Pr 100 Md 150",1060.9000000000001]
[null,"X5D-20.22B100","XINNIX X5D Schuifdeursysteem B 2200  H 2000 Pr 100 Md 150",1060.9000000000001]
[null,"X5D-20.23B100","XINNIX X5D Schuifdeursysteem B 2300  H 2000 Pr 100 Md 150",1060.9000000000001]
[null,"X5D-20.24B100","XINNIX X5D Schuifdeursysteem B 2400  H 2000 Pr 100 Md 150",1060.9000000000001]
[null,"X5D-20.25B100","XINNIX X5D Schuifdeursysteem B 2500  H 2000 Pr 100 Md 150",1363.26]
[null,"X5D-20.26B100","XINNIX X5D Schuifdeursysteem B 2600  H 2000 Pr 100 Md 150",1363.26]
[null,"X5D-20.27B100","XINNIX X5D Schuifdeursysteem B 2700  H 2000 Pr 100 Md 150",1363.26]
[null,"X5D-20.28B100","XINNIX X5D Schuifdeursysteem B 2800  H 2000 Pr 100 Md 150",1363.26]
[null,"X5D-20.29B100","XINNIX X5D Schuifdeursysteem B 2900  H 2000 Pr 100 Md 150",1363.26]
[null,"X5D-20.30B100","XINNIX X5D Schuifdeursysteem B 3000  H 2000 Pr 100 Md 150",1363.26]
[null,"X5D-21.15B100","XINNIX X5D Schuifdeursysteem B 1500  H 2100 Pr 100 Md 150",758.54]
[null,"X5D-21.16B100","XINNIX X5D Schuifdeursysteem B 1600  H 2100 Pr 100 Md 150",758.54]
[null,"X5D-21.17B100","XINNIX X5D Schuifdeursysteem B 1700  H 2100 Pr 100 Md 150",758.54]
[null,"X5D-21.18B100","XINNIX X5D Schuifdeursysteem B 1800  H 2100 Pr 100 Md 150",758.54]
{"$rows_left_out":157}
{"sheet":"STAANDERS","index":4,"n_rows":46,"n_cols":7,"rows_kept":46,"cut":false,"hidden":true,"merged":[]}
[]
[null,null,"X5-1972",null,null,"XINNIX X5 Schuifdeursysteem Enkele beplating (1/2)",280.09200000000004]
[null,null,"X5-2015",null,null,"XINNIX X5 Schuifdeursysteem Enkele beplating (1/2)",280.09200000000004]
[null,null,"X5-2040",null,null,"XINNIX X5 Schuifdeursysteem Enkele beplating (1/2)",280.09200000000004]
[null,null,"X5-2115",null,null,"XINNIX X5 Schuifdeursysteem Enkele beplating (1/2)",280.09200000000004]
[null,null,"X5-2315",null,null,"XINNIX X5 Schuifdeursysteem Enkele beplating (1/2)",294.83100000000002]
[null,null,"X5D-1972",null,null,"XINNIX X5D Schuifdeursysteem Dubbele Beplating (1/2)",280.09200000000004]
[null,null,"X5D-2015",null,null,"XINNIX X5D Schuifdeursysteem Dubbele Beplating (1/2)",280.09200000000004]
[null,null,"X5D-2040",null,null,"XINNIX X5D Schuifdeursysteem Dubbele Beplating (1/2)",280.09200000000004]
[null,null,"X5D-2115",null,null,"XINNIX X5D Schuifdeursysteem Dubbele Beplating (1/2)",280.09200000000004]
[null,null,"X5D-2315",null,null,"XINNIX X5D Schuifdeursysteem Dubbele Beplating (1/2)",294.83100000000002]
[null,null,"X5D-2415",null,null,"XINNIX X5D Schuifdeursysteem Dubbele Beplating (1/2)",294.83100000000002]
[null,null,"X5D-2715",null,null,"XINNIX X5D Schuifdeursysteem Dubbele Beplating (1/2)",464.35500000000002]
[null,null,"X5D-3015",null,null,"XINNIX X5D Schuifdeursysteem Dubbele Beplating (1/2)",493.85340000000002]
[null,null,"X5D32-1972",null,null,"XINNIX X5D32 Schuifdeursysteem Dubbele Beplating (1/2)",309.0804]
[null,null,"X5D32-2015",null,null,"XINNIX X5D32 Schuifdeursysteem Dubbele Beplating (1/2)",309.0804]
[null,null,"X5D32-2040",null,null,"XINNIX X5D32 Schuifdeursysteem Dubbele Beplating (1/2)",309.0804]
[null,null,"X5D32-2115",null,null,"XINNIX X5D32 Schuifdeursysteem Dubbele Beplating (1/2)",309.0804]
[null,null,"X5D32-2315",null,null,"XINNIX X5D32 Schuifdeursysteem Dubbele Beplating (1/2)",324.32940000000002]
[null,null,"X5D32-2415",null,null,"XINNIX X5D32 Schuifdeursysteem Dubbele Beplating (1/2)",324.32940000000002]
{"$rows_left_out":27}
{"sheet":"MIDDENSTAANDERS","index":5,"n_rows":6,"n_cols":5,"rows_kept":6,"cut":false,"hidden":true,"merged":[]}
[]
[null,"X5D/XM2115",null,"Extra set middenstaanders  breedte>1230 mm H 2115",162.15959999999998]
[null,"X5D/XM2315",null,"Extra set middenstaanders  breedte>1230 mm H 2315",176.90880000000001]
[null,"X5D/XM2715",null,"Extra set middenstaanders  breedte>1230 mm H 2715",265.35300000000001]
[null,"X5D/XM3015",null,"Extra set middenstaanders  breedte>1230 mm H 3015",287.47679999999997]
[null,"X5D/XM3515",null,"Extra set middenstaanders  breedte>1230 mm H 3515",339.0684]

{"sheet":"RAIL","index":6,"n_rows":50,"n_cols":10,"rows_kept":50,"cut":false,"hidden":true,"merged":[]}
[]
[null,"X5-0830.75","XINNIX X5 Schuifdeursysteem doorgang B 800  Pr 75 Md 100/125  (2/2)",null,268.31100000000004,null,null,null,"X5050","X5 synchroon systeem voor dubbele schuifdeur"]
[null,"X5-0930.75","XINNIX X5 Schuifdeursysteem doorgang B 900  Pr 75 Md 100/125  (2/2)",null,268.31100000000004,null,null,null,"X5060","X5 parallel systeem met tandriem "]
[null,"X5-1030.75","XINNIX X5 Schuifdeursysteem doorgang B 1000 Pr 75 Md 100/125  (2/2)",null,268.31100000000004,null,null,null,"X5065-L","Aanhaakset voor parallelsysteem links "]
[null,"X5-1230.75","XINNIX X5 Schuifdeursysteem doorgang B 1200 Pr 75 Md 100/125  (2/2)",null,319.40280000000001,null,null,null,"X5065-R","Aanhaakset voor parallelsysteem rechts "]
[null,"X5-1530.75","XINNIX X5 Schuifdeursysteem doorgang B 1500 Pr 75 Md 100/125  (2/2)",null,428.00220000000002]
[null,"X5-2030.75","XINNIX X5 Schuifdeursysteem doorgang B 2000 Pr 75 Md 100/125  (2/2)",null,600.36180000000002]
[null,"X5-0830.100","XINNIX X5 Schuifdeursysteem doorgang B 800 Pr 100 Md 125/150  (2/2)",null,268.31100000000004]
[null,"X5-0930.100","XINNIX X5 Schuifdeursysteem doorgang B 900 Pr 100 Md 125/150  (2/2)",null,268.31100000000004]
[null,"X5-1030.100","XINNIX X5 Schuifdeursysteem doorgang B 1000 Pr 100 Md 125/150  (2/2)",null,268.31100000000004]
[null,"X5-1230.100","XINNIX X5 Schuifdeursysteem doorgang B 1200 Pr 100 Md 125/150  (2/2)",null,319.40280000000001]
[null,"X5-1530.100","XINNIX X5 Schuifdeursysteem doorgang B 1500 Pr 100 Md 125/150  (2/2)",null,428.00220000000002]
[null,"X5-2030.100","XINNIX X5 Schuifdeursysteem doorgang B 2000 Pr 100 Md 125/150  (2/2)",null,600.36180000000002]
[null,"X5-2430.100","XINNIX X5 Schuifdeursysteem doorgang B 2400 Pr 100 Md 125/150  (2/2)",null,728.56560000000002]
[null,"X5-3030.100","XINNIX X5 Schuifdeursysteem doorgang B 3000 Pr 100 Md 125/150  (2/2)",null,977.38440000000003]
[null,"X5-0830.50GLC","XINNIX X5 Glas Schuifdeursysteem - klem met cover doorgang B 800 Pr 50 Md 100  (2/2)",null,498.28019999999998]
[null,"X5-0930.50GLC","XINNIX X5 Glas Schuifdeursysteem - klem met cover doorgang B 900 Pr 50 Md 100  (2/2)",null,498.28019999999998]
[null,"X5-1030.50GLC","XINNIX X5 Glas Schuifdeursysteem - klem met cover doorgang B 1000 Pr 50 Md 100  (2/2)",null,498.28019999999998]
[null,"X5-0830.75GLC","XINNIX X5 Glas Schuifdeursysteem - klem met cover doorgang B 800 Pr 75 Md 100/125  (2/2)",null,511.05059999999997]
[null,"X5-0930.75GLC","XINNIX X5 Glas Schuifdeursysteem - klem met cover doorgang B 900 Pr 75 Md 100/125  (2/2)",null,511.05059999999997]
{"$rows_left_out":31}
{"sheet":"AFWERKING","index":7,"n_rows":186,"n_cols":4,"rows_kept":186,"cut":false,"hidden":true,"merged":[]}
[null,"X5D32-XINNIX/D.1","XINNIX X5D32 Afwerkset voor dubbele deuren voor dubbele beplating (vrije doorgang <2400 mm)",94.7988]
[null,"X5D32-XINNIX/D.2","XINNIX X5D32 Afwerkset voor dubbele deuren voor dubbele beplating (vrije doorgang 2400-4000 mm)",189.5976]
[null,"X5D32-XINNIX-23.139/1","XINNIX X5D32 Afwerkset H 2315 B 1230 voor dubbele beplating   (<1230mm)",187.8126]
[null,"X5D32-XINNIX-23.139/2","XINNIX X5D32 Afwerkset H 2315 B 2400 voor dubbele beplating   (1230mm - 2400mm)",238.12920000000003]
[null,"X5D32-XINNIX-23.139/3","XINNIX X5D32 Afwerkset H 2315 B 3600 voor dubbele beplating   (2400mm - 3600mm)",288.42539999999997]
[null,"X5D32-XINNIX-23.164/1","XINNIX X5D32 Afwerkset H 2315 B 1230 voor dubbele beplating   (<1230mm)",187.8126]
[null,"X5D32-XINNIX-23.164/2","XINNIX X5D32 Afwerkset H 2315 B 2400 voor dubbele beplating   (1230mm - 2400mm)",238.12920000000003]
[null,"X5D32-XINNIX-23.164/3","XINNIX X5D32 Afwerkset H 2315 B 3600 voor dubbele beplating   (2400mm - 3600mm)",288.42539999999997]
[null,"X5D32-XINNIX-27.139/1","XINNIX X5D32 Afwerkset H 2715 B 1230 voor dubbele beplating   (<1230mm)",265.10820000000001]
[null,"X5D32-XINNIX-27.139/2","XINNIX X5D32 Afwerkset H 2715 B 2400 voor dubbele beplating   (1230mm - 2400mm)",347.17740000000003]
[null,"X5D32-XINNIX-27.139/3","XINNIX X5D32 Afwerkset H 2715 B 3600 voor dubbele beplating   (2400mm - 3600mm)",428.64480000000003]
[null,"X5D32-XINNIX-27.164/1","XINNIX X5D32 Afwerkset H 2715 B 1230 voor dubbele beplating   (<1230mm)",265.10820000000001]
[null,"X5D32-XINNIX-27.164/2","XINNIX X5D32 Afwerkset H 2715 B 2400 voor dubbele beplating   (1230mm - 2400mm)",347.17740000000003]
[null,"X5D32-XINNIX-27.164/3","XINNIX X5D32 Afwerkset H 2715 B 3600 voor dubbele beplating   (2400mm - 3600mm)",428.64480000000003]
[null,"X5D32-XINNIX-30.139/1","XINNIX X5D32 Afwerkset H 3015 B 1230 voor dubbele beplating   (<1230mm)",280.37759999999997]
[null,"X5D32-XINNIX-30.139/2","XINNIX X5D32 Afwerkset H 3015 B 2400 voor dubbele beplating   (1230mm - 2400mm)",362.2122]
[null,"X5D32-XINNIX-30.139/3","XINNIX X5D32 Afwerkset H 3015 B 3600 voor dubbele beplating   (2400mm - 3600mm)",444.03659999999996]
[null,"X5D32-XINNIX-30.164/1","XINNIX X5D32 Afwerkset H 3015 B 1230 voor dubbele beplating   (<1230mm)",280.37759999999997]
[null,"X5D32-XINNIX-30.164/2","XINNIX X5D32 Afwerkset H 3015 B 2400 voor dubbele beplating   (1230mm - 2400mm)",362.2122]
[null,"X5D32-XINNIX-30.164/3","XINNIX X5D32 Afwerkset H 3015 B 3600 voor dubbele beplating   (2400mm - 3600mm)",444.03659999999996]
{"$rows_left_out":167}
{"sheet":"GREPEN","index":8,"n_rows":48,"n_cols":30,"rows_kept":48,"cut":false,"hidden":true,"merged":[]}
[null,null,null,null,null,null,12,null,null,null,null,null,null,null,null,null,null,null,null,null,null,null,null,null,"Kies hier uw greep"]
[10,"XA-3010.I","XINNIX INWERKSCHELP HALVE MAAN INOX 10 MM",71.5428,null,null,null,null,null,null,null,null,null,null,null,null,null,null,null,null,null,null,null,null,{"$f":"VLOOKUP('X5 CALCULATOR'!E21,GREPEN!G25:Z31,2,FALSE)","v":{"$error":"#N/A"}}]
[12,"XA-3012.I","XINNIX INWERKSCHELP HALVE MAAN INOX 12 MM",71.5428,null,null,null,null,null,null,null,null,null,null,null,null,null,null,null,null,null,null,null,null,{"$f":"VLOOKUP('X5 CALCULATOR'!E21,GREPEN!G25:Z31,3,FALSE)","v":{"$error":"#N/A"}}]
[35,"XA-3035.I","XINNIX INWERKSCHELP HALVE MAAN INOX 35 MM",88.158600000000007,null,null,null,null,null,null,null,null,null,null,null,null,null,null,null,null,null,null,null,null,{"$f":"VLOOKUP('X5 CALCULATOR'!E21,GREPEN!G25:Z31,4,FALSE)","v":{"$error":"#N/A"}}]
[40,"XA-3040.W","XINNIX INWERKSCHELP HALVE MAAN WIT 40 MM",85.598399999999998,null,null,null,null,null,null,null,null,null,null,null,null,null,null,null,null,null,null,null,null,{"$f":"VLOOKUP('X5 CALCULATOR'!E21,GREPEN!G25:Z31,5,FALSE)","v":{"$error":"#N/A"}}]
[40,"XA-3040.B","XINNIX INWERKSCHELP HALVE MAAN ZWART 40 MM",85.598399999999998,null,null,null,null,null,null,null,null,null,null,null,null,null,null,null,null,null,null,null,null,{"$f":"VLOOKUP('X5 CALCULATOR'!E21,GREPEN!G25:Z31,6,FALSE)","v":{"$error":"#N/A"}}]
[40,"XA-3040.I","XINNIX INWERKSCHELP HALVE MAAN INOX 40 MM",85.598399999999998,null,null,null,null,null,null,null,null,null,null,null,null,null,null,null,null,null,null,null,null,{"$f":"VLOOKUP('X5 CALCULATOR'!E21,GREPEN!G25:Z31,7,FALSE)","v":{"$error":"#N/A"}}]
[45,"XA-3045","XINNIX INWERKSCHELP HALVE MAAN INOX 45 MM",99.664199999999994,null,null,null,null,null,null,null,null,null,null,null,null,null,null,null,null,null,null,null,null,{"$f":"VLOOKUP('X5 CALCULATOR'!E21,GREPEN!G25:Z31,8,FALSE)","v":{"$error":"#N/A"}}]
[50,"XA-3050.I","XINNIX INWERKSCHELP HALVE MAAN INOX 50 MM",114.9948,null,null,null,null,null,null,null,null,null,null,null,null,null,null,null,null,null,null,null,null,{"$f":"VLOOKUP('X5 CALCULATOR'!E21,GREPEN!G25:Z31,9,FALSE)","v":{"$error":"#N/A"}}]
[60,"XA-3060.I","XINNIX INWERKSCHELP HALVE MAAN INOX 60 MM",121.39020000000001,null,null,null,null,null,null,null,null,null,null,null,null,null,null,null,null,null,null,null,null,{"$f":"VLOOKUP('X5 CALCULATOR'!E21,GREPEN!G25:Z31,10,FALSE)","v":{"$error":"#N/A"}}]
[40,"XA-3100.I","XINNIX INWERKSLOT INOX ROND",127.755,null,null,null,null,null,null,null,null,null,null,null,null,null,null,null,null,null,null,null,null,{"$f":"VLOOKUP('X5 CALCULATOR'!E21,GREPEN!G25:Z31,11,FALSE)","v":{"$error":"#N/A"}}]
[40,"XA-3105.I","XINNIX INWERKSLOT INOX",296.41200000000003,null,null,null,null,null,null,null,null,null,null,null,null,null,null,null,null,null,null,null,null,{"$f":"VLOOKUP('X5 CALCULATOR'!E21,GREPEN!G25:Z31,12,FALSE)","v":{"$error":"#N/A"}}]
[40,"XA-3300.I","XINNIX INWERKSLOT WC RECHTHOEK INOX",141.82079999999999,null,null,null,null,null,null,null,null,null,null,null,null,null,null,null,null,null,null,null,null,{"$f":"VLOOKUP('X5 CALCULATOR'!E21,GREPEN!G25:Z31,13,FALSE)","v":{"$error":"#N/A"}}]
[35,"XA-3335.I","XINNIX INWERKSCHELP RECHTHOEK INOX 35 MM",85.598399999999998,null,null,null,null,null,null,null,null,null,null,null,null,null,null,null,null,null,null,null,null,{"$f":"VLOOKUP('X5 CALCULATOR'!E21,GREPEN!G25:Z31,14,FALSE)","v":{"$error":"#N/A"}}]
[40,"XA-3340.W","XINNIX INWERKSCHELP RECHTHOEK WIT 40 MM",86.414400000000001,null,null,null,null,null,null,null,null,null,null,null,null,null,null,null,null,null,null,null,null,{"$f":"VLOOKUP('X5 CALCULATOR'!E21,GREPEN!G25:Z31,15,FALSE)","v":{"$error":"#N/A"}}]
[40,"XA-3340.B","XINNIX INWERKSCHELP RECHTHOEK ZWART 40 MM",85.598399999999998,null,null,null,null,null,null,null,null,null,null,null,null,null,null,null,null,null,null,null,null,{"$f":"VLOOKUP('X5 CALCULATOR'!E21,GREPEN!G25:Z31,16,FALSE)","v":{"$error":"#N/A"}}]
[40,"XA-3340.I","XINNIX INWERKSCHELP RECHTHOEK INOX 40 MM",85.598399999999998,null,null,null,null,null,null,null,null,null,null,null,null,null,null,null,null,null,null,null,null,{"$f":"VLOOKUP('X5 CALCULATOR'!E21,GREPEN!G25:Z31,17,FALSE)","v":{"$error":"#N/A"}}]
[45,"XA-3345.I","XINNIX INWERKSCHELP RECHTHOEK INOX 45 MM",91.98360000000001,null,null,null,null,null,null,null,null,null,null,null,null,null,null,null,null,null,null,null,null,{"$f":"VLOOKUP('X5 CALCULATOR'!E21,GREPEN!G25:Z31,18,FALSE)","v":{"$error":"#N/A"}}]
[50,"XA-3350.W","XINNIX INWERKSCHELP RECHTHOEK WIT 50 MM",99.664199999999994,null,null,null,null,null,null,null,null,null,null,null,null,null,null,null,null,null,null,null,null,{"$f":"VLOOKUP('X5 CALCULATOR'!E21,GREPEN!G25:Z31,19,FALSE)","v":{"$error":"#N/A"}}]
[50,"XA-3350.B","XINNIX INWERKSCHELP RECHTHOEK ZWART 50 MM",104.8152,null,null,null,null,null,null,null,null,null,null,null,null,null,null,null,null,null,null,null,null,{"$f":"VLOOKUP('X5 CALCULATOR'!E21,GREPEN!G26:AD32,20,FALSE)","v":{"$error":"#N/A"}}]
{"$rows_left_out":29}
{"sheet":"OPMERKINGEN","index":9,"n_rows":34,"n_cols":2,"rows_kept":34,"cut":false,"hidden":true,"merged":[]}
[]
[null,"Bij Hp>2315 mm neem dubbele beplating  X5D/X5D32"]
[null,"Bij Hp>3015 mm neem dubbele beplating X5D32"]
[null,"Bij Hp>2410 mm WALL met dubbele bepalting X5D/X5D32"]
[]
[null,"Extra set middenstaanders nodig"]
[null,"Bij Hp>2315 mm + MS75 op eigen risico (wij raden MS100 aan)"]
[]
[null,"Schuifdeur voor glas met MD 50 maar tot B 1030"]
[null,"MS 50 enkel bij glas mogelijk "]
[]
[null,"X5 afwerking XINNIX met MS 75 niet hoger dan 2315 mm"]
[null,"X5 afwerking XINNIX met MS 100 niet hoger dan 2315 mm"]
[null,"X5D afwerking XINNIX met MS75/100 en X5D32 met MS75 niet hoger dan 3015 mm"]
[null,"X5 MS75/X5D MS75/X5D MS 100 afwerking PURE niet hoger dan 3015 mm"]
[null,"X5 MS 75/X5D MS 50 niet hoger dan 2315 mm"]
[null,"X5D32 MS 50 niet hoger dan 2715 mm"]
[null,"De combinatie MS 50 en hout is niet mogelijk"]
[]
[null,"Deze hoogte is te hoog en niet mogelijk"]
{"$rows_left_out":15}
{"sheet":"INVULVELDEN","index":10,"n_rows":53,"n_cols":7,"rows_kept":53,"cut":false,"hidden":true,"merged":[]}
[]
["…"]
["Enkele (<2315) X5"]
["Dubbel X5D"]
["Dubbel X5D32"]
["Dubbel X5D50"]
["…",null,"Xinnix","Hout","Glas"]
[{"$f":"VLOOKUP('X5 CALCULATOR'!E5,C7:E9,2,FALSE)","v":{"$error":"#N/A"}},null,"Hawa","Hout"]
[{"$f":"VLOOKUP('X5 CALCULATOR'!E5,C7:E9,3,FALSE)","v":{"$error":"#N/A"}},null,"Xinnix Double Soft Slide","Hout","Glas"]
[]
["…"]
["Enkele"]
["Dubbele"]
[]
["…"]
["Pocket"]
["Wall"]
[]
["…"]
[{"$f":"VLOOKUP('X5 CALCULATOR'!E5,C20:E22,2,FALSE)","v":{"$error":"#N/A"}},null,"Xinnix","XINNIX","PURE"]
{"$rows_left_out":33}